{"text_format":"1","workbook":"xlsx","n_sheets":4,"sheets":["форма","вычисл","заказ","Лист1"],"not_rendered":{"charts":0,"images":1,"macros":1,"external_links":0,"defined_names":29,"comments":0,"pivot_tables":0},"unopened":[],"bounds":{"document_bytes":16777216,"sheet_cells":100000,"rows_first":2000,"rows_last":500,"rows_between":2000,"halvings":0,"cell_chars":16384,"cell_head_chars":4096},"cells_cut":0,"cells_raw":0,"read":"whole","date_system":"1900"}

{"sheet":"форма","index":0,"n_rows":108,"n_cols":15,"rows_kept":108,"cut":false,"hidden":false,"merged":[[32,0,32,4],[33,0,33,4],[17,5,17,12],[31,0,31,4],[18,5,25,12],[29,0,29,4],[28,5,28,12],[28,0,28,4],[1,5,1,6],[1,1,1,2],[9,1,9,2],[15,1,15,2],[13,8,14,12],[13,1,13,2],[3,1,3,2],[11,1,11,2],[5,8,6,12],[5,5,6,5],[36,0,36,4],[29,5,29,12],[30,5,30,12],[13,5,14,6],[31,5,31,12],[35,0,35,3],[35,5,35,12],[30,0,30,1],[34,0,34,4],[32,5,32,12],[106,0,106,12],[107,0,107,12],[5,1,7,1],[5,0,7,0],[9,8,9,12],[3,8,3,12],[19,1,19,2],[37,0,44,4],[104,0,104,12],[27,0,27,4],[5,6,6,6],[11,11,11,12],[11,8,11,10],[105,0,105,12],[21,1,21,2],[34,5,34,12],[17,1,17,2],[33,5,33,12],[37,5,44,12],[36,5,36,12]]}
[]
[1,"Контролируемый газ:",null,null,null,"13 Пульт",null,null,{"$f":"IF(вычисл!D57,вычисл!D58,\"\")","v":""},{"$f":"IF(вычисл!D57,вычисл!D59,\" \")","v":" "}]
[]
[2,"Область применения",null,1,null,{"$f":"IF(вычисл!D57,\"Длина кабеля пульта, м\",\"\")","v":""},10,null,{"$f":"IF(вычисл!D57,\"Укажите нужную (не более 500 м)\",\"\")","v":""}]
[]
[3,{"$f":"IF(O6<1,\"Слишком много сигнализаторов!\",\"Требуемое количество сигнализаторов:\")","v":"Требуемое количество сигнализаторов:"},{"$f":"IF(OR(GAZZ=1,GAZZ=3,GAZZ=6),\"На горючий газ:\",\"\")","v":"На горючий газ:"},1,null,{"$f":"IF(вычисл!K6>0,\"\",\"Длина кабеля связи, м\")","v":""},20,null,{"$f":"IF(F6=\"\",\"\",\"Соединяет между собой сигнализаторы. Укажите общую - не более 1000 м\")","v":""},null,null,null,null,null,{"$f":"VLOOKUP(1,вычисл!A18:BB57,30,0)","v":1}]
[null,null,{"$f":"IF(OR(GAZZ=1,GAZZ=4),\"\",\"На оксид углерода:\")","v":""},1]
[null,null,{"$f":"IF(GAZZ<4,\"\",\"На сжиженный газ:\")","v":""},1]
[]
[4,"Количество порогов срабатывания \nпо горючему газу:",null,1,null,{"$f":"IF(вычисл!B65=\"Без клапана\",\"\",\"Длина кабеля клапана, м\")","v":"Длина кабеля клапана, м"},10]
[]
[5,{"$f":"IF(PROM1<3,\"Недоступно\",\"Возможность увеличения количества сигнализаторов\")","v":"Недоступно"},null,null,null,"Количество систем:",5,null,"Дата заполнения:",null,null,"2016-06-16",null,null," "]
[]
[6,{"$f":"IF(PROM1<3,\"Недоступно\",\"Возможность управления вентиляцией\")","v":"Недоступно"},null,null,null,{"$f":"IF(PROM1<3,\"Недоступно\",\"Энергозависимое \nисполнение\")","v":"Недоступно"},false,null,{"$f":"CONCATENATE(\"При отключении электроэнергии \",IF(AND(VLOOKUP(1,вычисл!A18:AE57,27,0)=1,ENERG1),\"клапан закроется\",\"клапан останется открытым\"))","v":"При отключении электроэнергии клапан останется открытым"},null,null,null,null,null,false]
[null,null,null,null,null,null,true]
[7,{"$f":"IF(PROM1<3,\"Недоступно\",\"Требуется диспетчеризация объекта\")","v":"Недоступно"},null,null,null,null,null,null,null,null,null,null,null,null,false]
[]
[8,{"$f":"IF(PROM1<3,\"Недоступно\",\"Адресная, с указанием номера сработавшего сигнализатора\")","v":"Недоступно"},null,null,null,"Координаты для связи (организации, регион, ФИО, телефон, e-mail),\nдополнительная информация:",null,null,null,null,null,null,null,null,false]
[null,null,null,null,null,"Наименование организации,\nконтактные данные"]
[9,{"$f":"IF(PROM1<3,\"Недоступно\",\"Наличие радиоканала\")","v":"Недоступно"},null,null,null,null,null,null,null,null,null,null,null,null,false]
[]
[10,"Тип клапана",null,4]
[]
[11,"Номинальное давление PN, Мпа",null,3]
[]
[12,"Номинальный диаметр DN"]
[]
[]
["Вашим требованиям удовлетворяет:",null,null,null,null,{"$f":"IF(F30=\" \",\" \",\"Альтернативный вариант:\")","v":" "}]
[{"$f":"IF(O6=0,\"Недопустимо!\",вычисл!B58)","v":"САКЗ-МК-1-1 бытовая"},null,null,null,null,{"$f":"вычисл!B59","v":" "}]
{"$rows_left_out":79}
{"sheet":"вычисл","index":1,"n_rows":71,"n_cols":39,"rows_kept":71,"cut":false,"hidden":true,"merged":[[15,27,15,28],[6,1,6,3],[7,1,7,3],[8,1,8,3],[9,1,9,3],[10,1,10,3],[11,1,11,3],[0,5,0,6],[0,15,0,16],[5,1,5,3],[3,1,3,3],[2,1,2,3],[1,1,1,3],[4,1,4,3]]}
[false,"Газ:",null,null,null,"Сфера",null,"Клапан","DN","PN","Каб связи",null,"пром",null,null,"Пороги СН"]
[1,"Природный газ",null,null,1,"Бытовая  \"А\"",0,{"$f":"IF(PROM1<3,\"КЗЭУГ-А(М)\",\"КЗЭУГ\")","v":"КЗЭУГ-А(М)"},{"$f":"IF($H$14<5,VLOOKUP(1,A$18:Y$56,18,0),\" \")","v":15},{"$f":"IF($H$14<5,VLOOKUP(1,$A$18:$AE$56,28,0),\"\")","v":0.1},{"$f":"((GAZZ=1)+(GAZZ=7))*(форма!D6=1)","v":1},"сн",null,null,null,{"$f":"1*(GAZZ<>2)","v":1}]
[{"$f":"A2+1","v":2},"Оксид углерода",null,null,4,"Бытовая",0,{"$f":"IF(PROM1<3,\"КЗЭУГ-Б\",\"КЗГЭМ-У\")","v":"КЗЭУГ-Б"},{"$f":"IF($H$14<5,VLOOKUP(1,A$18:Y$56,19,0),\"\")","v":20},{"$f":"IF($H$14<5,VLOOKUP(1,$A$18:$AE$56,29,0),\"\")","v":0.4},{"$f":"((GAZZ=2)+(GAZZ=8))*(форма!D7=1)","v":0},"со",null,null,null,{"$f":"(1+(PROM1>2))*(GAZZ<>2)","v":1}]
[{"$f":"A3+1","v":3},"Природный + оксид углерода",null,null,8,"Промышленная",{"$f":"(EXPAND1+VENTIL+RADIO1+DISPETCH+ADDDR)","v":0},{"$f":"IF(PROM1<3,\"КЗЭУГ\",\"Другой\")","v":"КЗЭУГ"},{"$f":"IF($H$14<5,VLOOKUP(1,A$18:Y$56,20,0),\"\")","v":25},null,{"$f":"((GAZZ=4)+(GAZZ=10))*(форма!D8=1)","v":0},"суг",null,{"$f":"(EXPAND1+ENERG1+VENTIL+RADIO1+DISPETCH+ADDDR)*(PROM1>2)","v":0},null,{"$f":"P3*(Q4=2)+P2*(Q4=1)","v":1},2]
[4,"Сжиженный газ",null,null,32,2,null,{"$f":"IF(PROM1<3,\"КЗГЭМ-У\",\"Без клапана\")","v":"КЗГЭМ-У"},{"$f":"IF($H$14<5,VLOOKUP(1,A$18:Y$56,21,0),\"\")","v":32},{"$f":"IF($H$14<5,VLOOKUP(1,$A$18:$AE$56,31,0),\"\")","v":" "},null,null,null,null,null,"Расшир","ЭнЗавис"]
[5,"Сжиженный газ + оксид углерода",null,null,8388608,null,null,{"$f":"VLOOKUP(1,A18:O57,15,0)","v":" "},{"$f":"IF($H$14<5,VLOOKUP(1,A$18:Y$56,22,0),\"\")","v":" "},null,{"$f":"SUM(K2:K4)","v":1},null,null,null,null,false,false]
[6,{"$f":"IF(PROM1=1,\"\",\"Природный + сжиженный + оксид углерода\")","v":"Природный + сжиженный + оксид углерода"},null,null,33554432,null,null,null,{"$f":"IF($H$14<5,VLOOKUP(1,A$18:Y$56,23,0),\"\")","v":" "},null,null,null,null,null,null,"Вентил","Радио"]
[7,"Природный газ 2",null,null,2,null,null,null,{"$f":"IF($H$14<5,VLOOKUP(1,A$18:Y$56,24,0),\"\")","v":" "},null,null,null,null,null,null,false,false]
[8,"Оксид углерода",null,null,4,null,null,null,{"$f":"IF($H$14<5,VLOOKUP(1,A$18:Y$56,25,0),\"\")","v":" "},null,null,null,null,null,null,"Диспетч","Адресн"]
[9,"Природный газ 2 + оксид углерода",null,null,16,null,null,null,null,null,null,null,null,null,null,false,false]
[10,"Сжиженный газ 2",null,null,64]
[11,"Сжиженный газ 2 + оксид углерода",null,null,16777216]
[12,"СН 2 + СУГ 2 + СО",null,null,33554432,null,null,{"$f":"INDIRECT(CONCATENATE(\"h\",H14+1))","v":"КЗЭУГ-А(М)"}]
[13,1,null,null,null,null,null,1,1,1,null,{"$f":"GAZZ+2*PROM1+4*G4+8*POROG","v":13}]
[]
[null,null,null,null,null,null,null,null,null,null,null,null,null,null,null,"Пульт",null,null,null,null,null,null,null,null,null,"БСУ","ЭЗАВ","Давление",null,"низя"]
["Индекс","Система","CH1","CH2","CO","CН 1 + \nСО","CН 2 + \nСО","СУГ 1","СУГ 1 + \nСО","СН + \nСУГ + \nСО",11,12,13,14,15,16,17,18,19,20,21,22,23,24,25,26,27,28,29,30,31,32,33,34,35,36,37]
[{"$f":"SUM(C18:J18)*OR(H14<5)","v":0},"САКЗ-МК-1А",{"$f":"(PROM1=1)*(форма!D6<300)*(POROG=1)*(GAZZ=1)","v":0},null,null,null,null,null,null,null,"КЗЭУГ-А(М)","КЗЭУГ-Б","Без клапана","Без клапана"," ","ПК-2",null,15,20,25," "," "," "," "," "," ",0,{"$f":"(AND(PROM1=1,$H$14=1)*0.01+AND(PROM1=1,$H$14=2)*0.005)*($H$14<5)","v":0},{"$f":"IF(AND(PROM1=1,$H$14=1),0.1,\" \")","v":" "},{"$f":"IF(форма!D6<3,2,0)","v":2}," ",{"$f":"CONCATENATE(\"СЗ-1А - \",форма!$D$6,\" шт,\")","v":"СЗ-1А - 1 шт,"}," ",null,null," ","Бытовая система. Количество сигнализаторов - не более 2.\nИспользуются клапаны типа КЗЭУГ-А или КЗЭУГ-Б DN15…25. \nДлина кабеля клапана - 3м (по заказу - до 10м). \nВозможно подключение пожарных извещателей типа ИП212-34АВТ, ИП212-50М.\nНапряжение питания сигнализаторов СЗ-1-1АГ  ~230В (СЗ-1-1АВ  =5В).\nПри отключении питания клапан останется открытым."," "]
[{"$f":"SUM(C19:J19)*OR(H14<5)+A18","v":0},"САКЗ-МК-2А",null,null,{"$f":"(PROM1=1)*(форма!D7<300)*(GAZZ=2)*(POROG<>2)","v":0},null,null,null,null,null,"КЗЭУГ-А(М)","КЗЭУГ-Б","Без клапана","Без клапана"," ","ПК-2",null,15,20,25," "," "," "," "," "," ",0,{"$f":"(AND(PROM1=1,$H$14=1)*0.01+AND(PROM1=1,$H$14=2)*0.005)*($H$14<5)","v":0},{"$f":"IF(AND(PROM1=1,$H$14=1),0.1,\" \")","v":" "},{"$f":"IF(форма!D7<3,2,0)","v":2}," ",null,{"$f":"CONCATENATE(\"СЗ-2А - \",форма!D$7,\" шт,\")","v":"СЗ-2А - 1 шт,"},null,null," ","Бытовая система. Количество сигнализаторов - не более 2.\nИспользуются клапаны типа КЗЭУГ-А или КЗЭУГ-Б DN15…25. \nДлина кабеля клапана - 3м (по заказу - до 10м). \nВозможно подключение пожарных извещателей типа ИП212-34АВТ, ИП212-50М.\nНапряжение питания сигнализаторов СЗ-2-2АГ  ~230В (СЗ-2-2АВ  =5В).\nПри отключении питания клапан останется открытым."," "]
[{"$f":"SUM(C20:J20)*OR(H14<5)+A19","v":0},"САКЗ-МК-2А",null,null,null,{"$f":"(PROM1=1)*(форма!D6+форма!D7<500)*(GAZZ=3)*(POROG=1)*NOT(Q1)","v":0},null,null,null,null,"КЗЭУГ-А(М)","КЗЭУГ-Б","Без клапана","Без клапана"," ","ПК-2",null,15,20,25," "," "," "," "," "," ",0,{"$f":"(AND(PROM1=1,$H$14=1)*0.01+AND(PROM1=1,$H$14=2)*0.005)*($H$14<5)","v":0},{"$f":"IF(AND(PROM1=1,$H$14=1),0.1,\" \")","v":" "},{"$f":"IF((форма!D6+форма!D7)<5,2,0)","v":2}," ",{"$f":"AF18","v":"СЗ-1А - 1 шт,"},{"$f":"AG19","v":"СЗ-2А - 1 шт,"},null,null," ","Бытовая система. Количество сигнализаторов - не более 3.\nИспользуются клапаны типа КЗЭУГ-А или КЗЭУГ-Б DN15…25. \nДлина кабеля клапана - 3м (по заказу - до 10м). \nВозможно подключение пожарных извещателей типа ИП212-34АВТ, ИП212-50М.\nНапряжение питания сигнализаторов СЗ-1-1АГ, СЗ-2-2АГ  ~230В (СЗ-1-1АВ, СЗ-2-2АВ  =5В).\nПри отключении питания клапан останется открытым."," "]
[{"$f":"SUM(C21:J21)+A19","v":1},"САКЗ-МК-1-1 бытовая",{"$f":"(PROM1=2)*(форма!D6<200)*(GAZZ=1)*(POROG=1)","v":1},null,null,null,null,null,null,null,"КЗЭУГ","КЗГЭМ-У","Без клапана","Без клапана"," ","ПК-2",null,15,20,25,32," "," "," "," "," ",0,{"$f":"($H$14<5)*0.1","v":0.1},{"$f":"0.4*($H$14<5)","v":0.4},{"$f":"IF(форма!D6<2,1,0)","v":1}," ",{"$f":"CONCATENATE(\"СЗ-1-1ГТ - \",форма!D$6,\" шт,\")","v":"СЗ-1-1ГТ - 1 шт,"}," "," "," "," ","Бытовая система. Количество сигнализаторов 1.\nИспользуются клапаны типа КЗЭУГ DN15…32. \nДлина кабеля клапана - 3м (по заказу - до 10м). \nНапряжение питания  ~230В.\nПри отключении питания клапан останется открытым."," "]
[{"$f":"SUM(C22:J22)+A21","v":1},"САКЗ-МК-1-1 бытовая, сжиженный газ"," ",null,null,null,null,{"$f":"(PROM1=2)*(форма!D8<200)*(B14=4)*(POROG=1)","v":0},null,null,"КЗЭУГ","КЗГЭМ-У","Без клапана","Без клапана"," ","ПК-2",null,15,20,25,32," "," "," "," "," ",0,{"$f":"($H$14<5)*0.1","v":0.1},{"$f":"0.4*($H$14<5)","v":0.4},{"$f":"IF(форма!D8<2,1,0)","v":1}," ",{"$f":"CONCATENATE(\"СЗ-3-1С - \",форма!D$8,\" шт,\")","v":"СЗ-3-1С - 1 шт,"}," ",null,null," ","Бытовая система. Количество сигнализаторов 1.\nИспользуются клапаны типа КЗЭУГ DN15…32. \nДлина кабеля клапана - 3м (по заказу - до 10м). \nНапряжение питания  ~230В.\nПри отключении питания клапан останется открытым."," "]
[1,"САКЗ-МК-2-1 бытовая",null,null,{"$f":"(PROM1=2)*(форма!D7<300)*(GAZZ=2)","v":0},null,null,null,null,null,"КЗЭУГ","КЗГЭМ-У","Без клапана","Без клапана"," ","ПК-2",null,15,20,25,32," "," "," "," "," ",0,{"$f":"($H$14<5)*0.1","v":0.1},{"$f":"0.4*($H$14<5)","v":0.4},{"$f":"IF(форма!D7<2,2,0)","v":2}," ",null,{"$f":"CONCATENATE(\"СЗ-2-2В - \",форма!D$7,\" шт,\")","v":"СЗ-2-2В - 1 шт,"},null,null," ","Бытовая система. Количество сигнализаторов  не более 2.\nИспользуются клапаны типа КЗЭУГ DN15…32. \nДлина кабеля клапана - 3м (по заказу - до 10м). \nНапряжение питания  ~230В.\nПри отключении питания клапан останется открытым."," "]
[{"$f":"SUM(C24:J24)+A23","v":1},"САКЗ-МК-2-1 бытовая",null,null,null,{"$f":"(PROM1=2)*NOT(Q1)*(форма!D6+форма!D7<300)*(GAZZ=3)*(NOT(VENTIL))*(POROG=1)","v":0},null,null,null,null,"КЗЭУГ","КЗГЭМ-У","Без клапана","Без клапана"," ","ПК-2",null,15,20,25,32," "," "," "," "," ",0,{"$f":"($H$14<5)*0.1","v":0.1},{"$f":"0.4*($H$14<5)","v":0.4},{"$f":"IF((форма!D6+форма!D7)<3,2,0)","v":2}," ",{"$f":"CONCATENATE(\"СЗ-1-1ГТ - \",форма!D$6,\" шт,\")","v":"СЗ-1-1ГТ - 1 шт,"},{"$f":"AG23","v":"СЗ-2-2В - 1 шт,"},null,null," ","Бытовая система. Количество сигнализаторов  не более 2.\nИспользуются клапаны типа КЗЭУГ DN15…32. \nДлина кабеля клапана - 3м (по заказу - до 10м). \nНапряжение питания  ~230В.\nПри отключении питания клапан останется открытым."," "]
[{"$f":"SUM(C25:J25)+A23","v":1},"САКЗ-МК-2-1 бытовая, сжиженный газ"," ",null,null,null,null,null,{"$f":"(PROM1=2)*(форма!D7<300)*NOT(G4)*(форма!D8<200)*(GAZZ=5)*(POROG=1)","v":0},null,"КЗЭУГ","КЗГЭМ-У","Без клапана","Без клапана"," ","ПК-2",null,15,20,25,32," "," "," "," "," ",0,{"$f":"($H$14<5)*0.1","v":0.1},{"$f":"0.4*($H$14<5)","v":0.4},{"$f":"IF((форма!D8+форма!D7)<3,2,0)","v":2}," ",{"$f":"CONCATENATE(\"СЗ-3-1С - \",форма!D$8,\" шт,\")","v":"СЗ-3-1С - 1 шт,"},{"$f":"AG23","v":"СЗ-2-2В - 1 шт,"},null,null," ","Бытовая система. Количество сигнализаторов  не более 2.\nИспользуются клапаны типа КЗЭУГ DN15…32. \nДлина кабеля клапана - 3м (по заказу - до 10м). \nНапряжение питания  ~230В.\nПри отключении питания клапан останется открытым."," "]
[1,"САКЗ-МК-1-1",{"$f":"(PROM1=3)*(форма!D6>0)*(POROG=1)*(GAZZ=1)*(NOT(DISPETCH))*(NOT(ADDDR))*(NOT(RADIO1))","v":0},null,null,null,null,null,null,null,"КЗЭУГ","КЗГЭМ-У","другой","Без клапана"," ","ПК-2",null,{"$f":"IF($H$14<2,15,IF($H$14>2,\" \",25))","v":15},{"$f":"IF($H$14<2,20,IF($H$14>2,\" \",32))","v":20},{"$f":"IF($H$14<2,25,IF($H$14>2,\" \",40))","v":25},{"$f":"IF($H$14<2,32,IF($H$14>2,\" \",50))","v":32},{"$f":"IF($H$14<2,40,IF($H$14>2,\" \",65))","v":40},{"$f":"IF($H$14<2,50,IF($H$14>2,\" \",80))","v":50},{"$f":"IF($H$14<2,\" \",IF($H$14>2,\" \",100))","v":" "},{"$f":"IF($H$14<2,\" \",IF($H$14>2,\" \",150))","v":" "},{"$f":"IF(VENTIL,\"Требуется БСУ\",\" \")","v":" "},1,{"$f":"IF($H$14>2,\" \",0.1*($H$14<5))","v":0.1},{"$f":"IF($H$14>2,\"\",4*AB26)","v":0.4},1," ",{"$f":"CONCATENATE(\"СЗ-1-1Г - \",форма!D$6,\" шт,\")","v":"СЗ-1-1Г - 1 шт,"}," ",{"$f":"AF36","v":"СЗ-1Е(В) - 1 шт,"},null,{"$f":"IF(VENTIL,\"Требуется БСУ-Е\",\" \")","v":" "},{"$f":"CONCATENATE(\"Количество сигнализаторов не ограничено.\nИспользуются клапаны типа КЗЭУГ или КЗГЭМ-У DN15…150. \nДлина кабеля клапана - 10м (по заказу - до 20м). \nНапряжение питания сигнализаторов  ~230В.\",\"\n\",Z26)","v":"Количество сигнализаторов не ограничено.\nИспользуются клапаны типа КЗЭУГ или КЗГЭМ-У DN15…150. \nДлина кабеля клапана - 10м (по заказу - до 20м). \nНапряжение питания сигнализаторов  ~230В.\n "},{"$f":"CONCATENATE(AM26,\"\n\",AJ26)","v":"Количество сигнализаторов не более 250.  \nИспользуются клапаны типа КЗЭУГ или КЗГЭМ-У DN15…150. \nДлина кабеля клапана - 10м (по заказу - до 20м). \nНапряжение питания сигнализаторов  СЗ-1Е ~230В (СЗ-1ЕВ  =10,5…28,5В).\nВозможно подключение пожарных извещателей типа ИП212-45.\nВозможно подключение до трех пультов ПД-Е(В).\n "},"Количество сигнализаторов не более 250.  \nИспользуются клапаны типа КЗЭУГ или КЗГЭМ-У DN15…150. \nДлина кабеля клапана - 10м (по заказу - до 20м). \nНапряжение питания сигнализаторов  СЗ-1Е ~230В (СЗ-1ЕВ  =10,5…28,5В).\nВозможно подключение пожарных извещателей типа ИП212-45.\nВозможно подключение до трех пультов ПД-Е(В)."]
[1,"САКЗ-МК-1-2",null,{"$f":"(PROM1=3)*(форма!D6>0)*(POROG=2)*(GAZZ=1)*(NOT(DISPETCH))*(NOT(ADDDR))*(NOT(RADIO1))","v":0},null,null,null,null,null,null,"КЗЭУГ","КЗГЭМ-У","другой","Без клапана"," ","ПК-2",null,{"$f":"IF($H$14<2,15,IF($H$14>2,\" \",25))","v":15},{"$f":"IF($H$14<2,20,IF($H$14>2,\" \",32))","v":20},{"$f":"IF($H$14<2,25,IF($H$14>2,\" \",40))","v":25},{"$f":"IF($H$14<2,32,IF($H$14>2,\" \",50))","v":32},{"$f":"IF($H$14<2,40,IF($H$14>2,\" \",65))","v":40},{"$f":"IF($H$14<2,50,IF($H$14>2,\" \",80))","v":50},{"$f":"IF($H$14<2,\" \",IF($H$14>2,\" \",100))","v":" "},{"$f":"IF($H$14<2,\" \",IF($H$14>2,\" \",150))","v":" "},{"$f":"Z26","v":" "},1,{"$f":"IF($H$14>2,\" \",0.1*($H$14<5))","v":0.1},{"$f":"IF($H$14>2,\"\",4*AB27)","v":0.4},1," ",{"$f":"CONCATENATE(\"СЗ-1-2Г - \",форма!D$6,\" шт,\")","v":"СЗ-1-2Г - 1 шт,"}," ",{"$f":"AF36","v":"СЗ-1Е(В) - 1 шт,"},null,{"$f":"AJ26","v":" "},{"$f":"AK26","v":"Количество сигнализаторов не ограничено.\nИспользуются клапаны типа КЗЭУГ или КЗГЭМ-У DN15…150. \nДлина кабеля клапана - 10м (по заказу - до 20м). \nНапряжение питания сигнализаторов  ~230В.\n "},{"$f":"AL26","v":"Количество сигнализаторов не более 250.  \nИспользуются клапаны типа КЗЭУГ или КЗГЭМ-У DN15…150. \nДлина кабеля клапана - 10м (по заказу - до 20м). \nНапряжение питания сигнализаторов  СЗ-1Е ~230В (СЗ-1ЕВ  =10,5…28,5В).\nВозможно подключение пожарных извещателей типа ИП212-45.\nВозможно подключение до трех пультов ПД-Е(В).\n "}]
[1,"САКЗ-МК-2-1",null,null,null,{"$f":"(PROM1=3)*(форма!D6>0)*(форма!D7>0)*(B14=3)*(NOT(DISPETCH))*(NOT(ADDDR))*NOT(RADIO1)*(POROG=1)","v":0},null,null,null,null,"КЗЭУГ","КЗГЭМ-У","другой","Без клапана"," ","ПДС",null,15,20,25,32,40,50," "," ","Блок БСУ",1,0.1,0.4,1," ",{"$f":"AF26","v":"СЗ-1-1Г - 1 шт,"},{"$f":"CONCATENATE(\" СЗ-2-2В - \",форма!D$7,\" шт,\")","v":" СЗ-2-2В - 1 шт,"},{"$f":"CONCATENATE(\"СЗ-1Е(В) - \",форма!D$6,\" шт,\",\" СЗ-2E - \",форма!D$7,\" шт,\")","v":"СЗ-1Е(В) - 1 шт, СЗ-2E - 1 шт,"},null,"Блок БСУ-Е","Количество сигнализаторов не ограничено.\nИспользуются клапаны типа КЗЭУГ, КЗГЭМ-У DN15…150 или другие. \nДлина кабеля клапана - 10м (по заказу - до 20м). \nНапряжение питания сигнализаторов  ~230В.","Количество сигнализаторов не более 250.\nИспользуются клапаны типа КЗЭУГ, КЗГЭМ-У DN15…150 или другой. \nДлина кабеля клапана - 10м (по заказу - до 20м). \nНапряжение питания сигнализаторов  СЗ-1Е, СЗ-2Е ~230В (СЗ-1ЕВ, СЗ-2ЕВ  =10,5…28,5В).\nВозможно подключение пожарных извещателей типа ИП212-45.\nВозможно подключение до трех пультов ПД-Е(В)."]
[1,"САКЗ-МК-2-2",null,null,null,null,{"$f":"(PROM1=3)*(форма!D6>0)*(форма!D7>0)*(B14=3)*(NOT(DISPETCH))*(NOT(ADDDR))*NOT(RADIO1)*(POROG=2)","v":0},null,null,null,"КЗЭУГ","КЗГЭМ-У","другой","Без клапана"," ","ПДС",null,15,20,25,32,40,50," "," ","Блок БСУ",1,0.1,0.4,1," ",{"$f":"CONCATENATE(\"СЗ-1-2Г - \",форма!D$6,\" шт,\")","v":"СЗ-1-2Г - 1 шт,"},{"$f":"CONCATENATE(\" СЗ-2-2В - \",форма!D$7,\" шт,\")","v":" СЗ-2-2В - 1 шт,"},{"$f":"AH28","v":"СЗ-1Е(В) - 1 шт, СЗ-2E - 1 шт,"},null,"Блок БСУ-Е",{"$f":"AK28","v":"Количество сигнализаторов не ограничено.\nИспользуются клапаны типа КЗЭУГ, КЗГЭМ-У DN15…150 или другие. \nДлина кабеля клапана - 10м (по заказу - до 20м). \nНапряжение питания сигнализаторов  ~230В."},{"$f":"AL28","v":"Количество сигнализаторов не более 250.\nИспользуются клапаны типа КЗЭУГ, КЗГЭМ-У DN15…150 или другой. \nДлина кабеля клапана - 10м (по заказу - до 20м). \nНапряжение питания сигнализаторов  СЗ-1Е, СЗ-2Е ~230В (СЗ-1ЕВ, СЗ-2ЕВ  =10,5…28,5В).\nВозможно подключение пожарных извещателей типа ИП212-45.\nВозможно подключение до трех пультов ПД-Е(В)."}]
[1,"САКЗ-МК-2 Оксид углерода",null,null,{"$f":"(PROM1=3)*(форма!D7>0)*(GAZZ=2)*NOT(ADDDR)*NOT(DISPETCH)*NOT(RADIO1)","v":0},null,null,null,null,null,"КЗЭУГ","КЗГЭМ-У","другой","Без клапана"," ","ПДС",null,15,20,25,32,40,50," "," ",{"$f":"Z26","v":" "},1,0.1,0.4,1," ",null,{"$f":"CONCATENATE(\" СЗ-2-2В - \",форма!D$7,\" шт,\")","v":" СЗ-2-2В - 1 шт,"},null,{"$f":"CONCATENATE(\" СЗ-2E(В) - \",форма!D$7,\" шт,\")","v":" СЗ-2E(В) - 1 шт,"},{"$f":"AJ26","v":" "},{"$f":"AK26","v":"Количество сигнализаторов не ограничено.\nИспользуются клапаны типа КЗЭУГ или КЗГЭМ-У DN15…150. \nДлина кабеля клапана - 10м (по заказу - до 20м). \nНапряжение питания сигнализаторов  ~230В.\n "},{"$f":"CONCATENATE(AM30,\"\n\",AJ30)","v":"Количество сигнализаторов не более 250.\nИспользуются клапаны типа КЗЭУГ или КЗГЭМ-У DN15…150. \nДлина кабеля клапана - 10м (по заказу - до 20м). \nНапряжение питания сигнализаторов  СЗ-2Е ~230В  (СЗ-2ЕВ  =10,5…28,5В).\nВозможно подключение пожарных извещателей типа ИП212-45.\nВозможно подключение до трех пультов ПД-Е(В).\n "},"Количество сигнализаторов не более 250.\nИспользуются клапаны типа КЗЭУГ или КЗГЭМ-У DN15…150. \nДлина кабеля клапана - 10м (по заказу - до 20м). \nНапряжение питания сигнализаторов  СЗ-2Е ~230В  (СЗ-2ЕВ  =10,5…28,5В).\nВозможно подключение пожарных извещателей типа ИП212-45.\nВозможно подключение до трех пультов ПД-Е(В)."]
{"$rows_left_out":42}
{"sheet":"заказ","index":2,"n_rows":15,"n_cols":4,"rows_kept":15,"cut":false,"hidden":false,"merged":[[14,1,14,3]]}
[]
[null,null,"Информация для заказа:",{"$f":"форма!L12","v":"2016-06-16"}]
[null,null,{"$f":"IF(вычисл!A$1,форма!F30,форма!A30)","v":"САКЗ-МК-1-1 бытовая"}]
[null,null,"В составе:"]
[null,null,{"$f":"IF(вычисл!A$1,форма!F32,форма!A32)","v":"Сигнализатор(ы) СЗ-1-1ГТ - 1 шт, "}]
[null,null,{"$f":"IF(вычисл!A$1,форма!F33,форма!A33)","v":""}]
[null,null,{"$f":"IF(вычисл!A$1,форма!F34,форма!A34)","v":"Клапан  КЗЭУГ-15   PN-0,1 МПа   кабель L=10м,"}]
[null,null,{"$f":"IF(вычисл!A$1,форма!F35,форма!A35)","v":" "}]
[null,null,{"$f":"IF(вычисл!A$1,форма!F36,форма!A36)","v":" "}]
[null,null,{"$f":"IF(AND(VLOOKUP(1,вычисл!A18:AE57,27,0)=1,ENERG1),\"Энергозависимая\",\"Энергонезависимая\")","v":"Энергонезависимая"}]
[null,null,{"$f":"CONCATENATE(\"Количество систем: \",форма!G12)","v":"Количество систем: 5"}]
[null,null,{"$f":"форма!F19","v":"Наименование организации,\nконтактные данные"}]
[null,null,"Альтернативный вариант"]
[]
[null,{"$f":"IF(вычисл!A1,VLOOKUP(1,вычисл!A18:BB57,38,0),VLOOKUP(1,вычисл!A18:BB57,37,0))","v":"Бытовая система. Количество сигнализаторов 1.\nИспользуются клапаны типа КЗЭУГ DN15…32. \nДлина кабеля клапана - 3м (по заказу - до 10м). \nНапряжение питания  ~230В.\nПри отключении питания клапан останется открытым."}]

{"sheet":"Лист1","index":3,"n_rows":14,"n_cols":31,"rows_kept":14,"cut":false,"hidden":true,"merged":[[9,8,11,10],[9,12,11,14],[9,26,11,28],[13,8,15,10],[13,12,15,14],[13,26,15,28],[13,30,15,32],[3,4,5,6],[3,8,5,10],[3,12,5,14],[3,18,9,22],[3,26,5,28],[9,4,11,6]]}
[]
[]
[]
[null,null,null,null,"СЗ-1",null,null,null,"СЗ-1",null,null,null,"СЗ-1",null,null,null,null,null,"БСУ-КС",null,null,null,null,null,null,null,"Пульт"]
[]
[]
[]
[]
[]
[null,null,null,null,"СЗ-2",null,null,null,"СЗ-2",null,null,null,"СЗ-2",null,null,null,null,null,null,null,null,null,null,null,null,null,"Клапан"]
[]
[]
[]
[null,null,null,null,null,null,null,null,"Датчики",null,null,null,"Датчики",null,null,null,null,null,null,null,null,null,null,null,null,null,"Исполнитель-ные устр-ва",null,null,null,"Исполнитель-ные устр-ва"]